bite_date,SpeciesIDDesc,BreedIDDesc,GenderIDDesc,color,vaccination_yrs,vaccination_date,victim_zip,AdvIssuedYNDesc,WhereBittenIDDesc,quarantine_date,DispositionIDDesc,head_sent_date,release_date,ResultsIDDesc
1985-05-05 00:00:00,DOG,,FEMALE,LIG. BROWN,1,1985-06-20 00:00:00,40229,NO,BODY,1985-05-05 00:00:00,UNKNOWN,,,UNKNOWN
1986-02-12 00:00:00,DOG,,UNKNOWN,BRO & BLA,,,40218,NO,BODY,1986-02-12 00:00:00,UNKNOWN,,,UNKNOWN
1987-05-07 00:00:00,DOG,,UNKNOWN,,,,40219,NO,BODY,1990-05-07 00:00:00,UNKNOWN,,,UNKNOWN
1988-10-02 00:00:00,DOG,,MALE,BLA & BRO,,,,NO,BODY,1990-10-02 00:00:00,UNKNOWN,,,UNKNOWN
1989-08-29 00:00:00,DOG,,FEMALE,BLK-WHT,,,,NO,BODY,,UNKNOWN,,,UNKNOWN
1989-11-24 00:00:00,DOG,,UNKNOWN,,,,40211,NO,BODY,,UNKNOWN,,,UNKNOWN
1990-02-08 00:00:00,DOG,,FEMALE,BLACK/WHIT,1,1990-02-13 00:00:00,40203,NO,BODY,1990-02-12 00:00:00,UNKNOWN,,,UNKNOWN
1990-02-22 00:00:00,DOG,,MALE,BLK-WHT,,,,NO,BODY,1990-02-23 00:00:00,RELEASED,,,UNKNOWN
1990-08-02 00:00:00,DOG,,MALE,BROWN,,,,NO,BODY,1990-08-02 00:00:00,UNKNOWN,,,UNKNOWN
1990-08-19 00:00:00,DOG,,UNKNOWN,BRN-TAN,,,,NO,BODY,1990-08-20 00:00:00,RELEASED,,,UNKNOWN
1990-08-31 00:00:00,DOG,,MALE,TRI,,,,NO,HEAD,1990-09-04 00:00:00,RELEASED,,,UNKNOWN
1990-10-20 00:00:00,DOG,,MALE,BLK,,,,NO,BODY,1990-10-22 00:00:00,RELEASED,,,UNKNOWN
1991-02-09 00:00:00,DOG,,MALE,BLK-BRN,,,,NO,BODY,1991-02-13 00:00:00,RELEASED,,,UNKNOWN
1991-07-05 00:00:00,DOG,,MALE,BLK-BRN,,,,YES,BODY,1991-07-09 00:00:00,RELEASED,,,UNKNOWN
1991-09-14 00:00:00,DOG,,MALE,WHT,,,,NO,BODY,1991-09-19 00:00:00,RELEASED,,,UNKNOWN
1991-10-09 00:00:00,DOG,,FEMALE,WHT-BRN,,,,NO,HEAD,1991-10-11 00:00:00,RELEASED,,,UNKNOWN
1991-11-07 00:00:00,DOG,,UNKNOWN,,,,,NO,BODY,1991-11-14 00:00:00,RELEASED,,,UNKNOWN
1992-02-08 00:00:00,DOG,,MALE,BLK,,,,NO,BODY,1992-02-12 00:00:00,UNKNOWN,,,UNKNOWN
1992-02-27 00:00:00,DOG,,MALE,BLK-TAN,,,,NO,BODY,1992-03-02 00:00:00,RELEASED,,,UNKNOWN
1992-03-06 00:00:00,DOG,,MALE,WHT,,,,NO,BODY,1992-03-11 00:00:00,RELEASED,,,UNKNOWN
1992-03-18 00:00:00,CAT,,UNKNOWN,,,,,NO,HEAD,1992-03-24 00:00:00,RELEASED,,,UNKNOWN
1992-04-06 00:00:00,DOG,,UNKNOWN,BLK,,,,NO,BODY,1992-04-08 00:00:00,RELEASED,,,UNKNOWN
1992-05-06 00:00:00,DOG,,UNKNOWN,BLK,,,,NO,BODY,1992-05-09 00:00:00,RELEASED,,,UNKNOWN
1992-06-04 00:00:00,DOG,,MALE,BRN,,,,NO,BODY,1992-06-10 00:00:00,RELEASED,,,UNKNOWN
1992-06-29 00:00:00,DOG,,FEMALE,RED,,,,NO,BODY,1992-06-30 00:00:00,RELEASED,,,UNKNOWN
1992-08-06 00:00:00,DOG,,UNKNOWN,WHITE,,,40215,NO,BODY,1992-08-06 00:00:00,RELEASED,,,UNKNOWN
1992-08-26 00:00:00,DOG,,MALE,BRN-BLK,,,40210,NO,BODY,1992-08-31 00:00:00,RELEASED,,,UNKNOWN
1993-04-04 00:00:00,DOG,,UNKNOWN,,,,,NO,BODY,1993-04-05 00:00:00,RELEASED,,,UNKNOWN
1993-04-06 00:00:00,CAT,,UNKNOWN,,,,,NO,BODY,1993-04-19 00:00:00,RELEASED,,,UNKNOWN
1993-05-12 00:00:00,DOG,,MALE,BRN,,,,NO,HEAD,1993-05-14 00:00:00,RELEASED,,,UNKNOWN
1993-06-20 00:00:00,DOG,,UNKNOWN,,,,,NO,BODY,1993-06-21 00:00:00,RELEASED,,,UNKNOWN
1993-07-09 00:00:00,DOG,,FEMALE,BRN,,,,YES,BODY,1993-07-09 00:00:00,RELEASED,,,UNKNOWN
1993-12-04 00:00:00,DOG,,UNKNOWN,,,,,NO,BODY,1993-12-06 00:00:00,RELEASED,,,UNKNOWN
1994-03-31 00:00:00,DOG,,MALE,BRN-BLK,,,,NO,BODY,1994-04-06 00:00:00,RELEASED,,,UNKNOWN
1994-04-11 00:00:00,DOG,,MALE,BLK,,,,NO,BODY,1994-04-13 00:00:00,RELEASED,,,UNKNOWN
1994-05-08 00:00:00,DOG,,UNKNOWN,,,,,NO,BODY,1994-05-09 00:00:00,RELEASED,,,UNKNOWN
1994-05-10 00:00:00,DOG,,FEMALE,MULT COLOR,,,,NO,HEAD,1994-05-13 00:00:00,RELEASED,,,UNKNOWN
1994-05-22 00:00:00,DOG,,MALE,TRI,,,,NO,BODY,1994-05-24 00:00:00,RELEASED,,,UNKNOWN
1994-06-10 00:00:00,DOG,,UNKNOWN,,,,,NO,BODY,1994-06-15 00:00:00,RELEASED,,,UNKNOWN
1994-07-21 00:00:00,DOG,,UNKNOWN,,,,,NO,BODY,1994-07-21 00:00:00,RELEASED,,,UNKNOWN
2009-10-29 00:00:00,CAT,,FEMALE,GRAY,,,40206,NO,BODY,2009-10-30 00:00:00,UNKNOWN,,,UNKNOWN
2009-12-02 00:00:00,DOG,,MALE,TAN-BRN,1,2010-01-16 00:00:00,40291,NO,BODY,2009-12-03 00:00:00,RELEASED,,,UNKNOWN
2009-12-11 00:00:00,DOG,,MALE,BLK-BRN,,,40272,NO,BODY,2009-12-11 00:00:00,RELEASED,,,UNKNOWN
2009-12-21 00:00:00,DOG,,UNKNOWN,BLACK,,,40218,NO,HEAD,2009-12-29 00:00:00,UNKNOWN,,,UNKNOWN
2009-12-24 00:00:00,DOG,,MALE,BRN-WHT,1,2009-04-30 00:00:00,40165,NO,HEAD,2009-12-28 00:00:00,RELEASED,,,UNKNOWN
2009-12-24 00:00:00,DOG,,UNKNOWN,BLACK,,,40229,NO,BODY,2009-12-29 00:00:00,UNKNOWN,,,UNKNOWN
2009-12-28 00:00:00,DOG,,UNKNOWN,BLACK,,,40299,NO,HEAD,2009-12-29 00:00:00,UNKNOWN,,,UNKNOWN
2009-12-29 00:00:00,DOG,,FEMALE,WHT-BRN,3,2008-06-07 00:00:00,40291,NO,BODY,2009-12-30 00:00:00,RELEASED,,,UNKNOWN
2009-12-30 00:00:00,DOG,,FEMALE,WHITE,3,2010-01-06 00:00:00,40229,NO,BODY,2009-12-31 00:00:00,RELEASED,,,UNKNOWN
2009-12-30 00:00:00,DOG,,MALE,BLK-WHT,,,40218,NO,BODY,2010-01-06 00:00:00,RELEASED,,,UNKNOWN
2009-12-30 00:00:00,DOG,,FEMALE,BLK-WHT,1,2009-12-26 00:00:00,40220,NO,BODY,2010-01-06 00:00:00,UNKNOWN,,,UNKNOWN
2009-12-31 00:00:00,DOG,,MALE,WHT-GRAY,3,2008-08-28 00:00:00,40220,NO,BODY,2010-01-04 00:00:00,RELEASED,,,UNKNOWN
2009-12-31 00:00:00,CAT,,MALE,WHITE,1,2010-01-14 00:00:00,40220,NO,BODY,2010-01-04 00:00:00,RELEASED,,,UNKNOWN
2009-12-31 00:00:00,DOG,,MALE,BRN,1,2009-07-23 00:00:00,40241,NO,BODY,2010-01-04 00:00:00,RELEASED,,,UNKNOWN
2010-01-01 00:00:00,DOG,,FEMALE,WHT,1,2009-10-22 00:00:00,40228,NO,BODY,2010-01-04 00:00:00,RELEASED,,,UNKNOWN
2010-01-02 00:00:00,DOG,,MALE,BLK-BRN,3,2008-02-07 00:00:00,40291,NO,HEAD,2010-01-04 00:00:00,RELEASED,,,UNKNOWN
2010-01-02 00:00:00,DOG,,UNKNOWN,,,,40219,YES,BODY,2010-01-04 00:00:00,UNKNOWN,,,UNKNOWN
2010-01-02 00:00:00,CAT,,FEMALE,,,,40291,NO,BODY,2010-01-04 00:00:00,RELEASED,,,UNKNOWN
2010-01-02 00:00:00,DOG,,UNKNOWN,BLK,,,40216,NO,BODY,2010-01-04 00:00:00,UNKNOWN,,,UNKNOWN
2010-01-02 00:00:00,DOG,,FEMALE,BRN-WHT,1,2010-01-27 00:00:00,40071,NO,HEAD,2010-01-06 00:00:00,RELEASED,,,UNKNOWN
2010-01-03 00:00:00,CAT,,UNKNOWN,BLK-WHT,,,40216,YES,BODY,2010-01-20 00:00:00,UNKNOWN,,,UNKNOWN
2010-01-04 00:00:00,DOG,,FEMALE,BLK,1,2010-01-15 00:00:00,40291,NO,BODY,2010-01-06 00:00:00,RELEASED,,,UNKNOWN
2010-01-04 00:00:00,DOG,,MALE,TAN,1,2009-09-01 00:00:00,40031,NO,HEAD,2010-01-15 00:00:00,RELEASED,,,UNKNOWN
2010-01-05 00:00:00,DOG,,MALE,BLK-TAN,1,2009-02-02 00:00:00,40241,NO,BODY,2010-01-06 00:00:00,UNKNOWN,,,UNKNOWN
2010-01-05 00:00:00,DOG,,FEMALE,BRN,1,2009-03-31 00:00:00,40291,NO,BODY,2010-01-06 00:00:00,RELEASED,,,UNKNOWN
2010-01-06 00:00:00,DOG,,UNKNOWN,BLUE,1,2009-05-20 00:00:00,40217,NO,BODY,2010-01-11 00:00:00,RELEASED,,,UNKNOWN
2010-01-07 00:00:00,DOG,,FEMALE,TAN,3,2010-02-01 00:00:00,40217,NO,HEAD,2010-01-08 00:00:00,RELEASED,,,UNKNOWN
2010-01-07 00:00:00,DOG,,MALE,BLK,3,2010-02-05 00:00:00,40219,NO,BODY,2010-01-08 00:00:00,RELEASED,,,UNKNOWN
2010-01-07 00:00:00,DOG,,MALE,COPPER-WHT,1,2009-03-10 00:00:00,40222,NO,BODY,2010-01-08 00:00:00,RELEASED,,,UNKNOWN
2010-01-08 00:00:00,DOG,,MALE,BLK-WHT,,,40214,NO,HEAD,2010-01-13 00:00:00,RELEASED,,,UNKNOWN
2010-01-08 00:00:00,DOG,,FEMALE,WHT-BUFF,1,2010-01-06 00:00:00,40291,NO,BODY,2010-01-11 00:00:00,RELEASED,,,UNKNOWN
2010-01-09 00:00:00,DOG,,UNKNOWN,BLK-WHT,,,40219,NO,BODY,,UNKNOWN,2010-01-10 00:00:00,,UNKNOWN
2010-01-09 00:00:00,CAT,,UNKNOWN,,,,40272,YES,BODY,2010-01-11 00:00:00,UNKNOWN,,,UNKNOWN
2010-01-09 00:00:00,CAT,,UNKNOWN,BLK,,,40272,NO,BODY,2010-01-09 00:00:00,UNKNOWN,,,UNKNOWN
2010-01-10 00:00:00,DOG,,UNKNOWN,WHT,,,40229,YES,HEAD,2010-01-11 00:00:00,UNKNOWN,,,UNKNOWN
2010-01-11 00:00:00,DOG,,MALE,BRN,1,2010-02-02 00:00:00,40272,NO,BODY,2010-01-11 00:00:00,RELEASED,,,UNKNOWN
2010-01-11 00:00:00,DOG,,MALE,BLK-WHT,3,,40272,NO,HEAD,2010-01-12 00:00:00,RELEASED,,,UNKNOWN
2010-01-11 00:00:00,DOG,,FEMALE,BRINDLE,3,2007-03-16 00:00:00,40272,NO,HEAD,2010-01-12 00:00:00,RELEASED,,,UNKNOWN
2010-01-12 00:00:00,DOG,,MALE,BRN-WHT,,,40214,NO,BODY,,UNKNOWN,2010-01-14 00:00:00,,UNKNOWN
2010-01-12 00:00:00,DOG,,MALE,TRI,,,40204,YES,BODY,2010-01-13 00:00:00,UNKNOWN,,,UNKNOWN
2010-01-12 00:00:00,DOG,,MALE,BLK,1,2009-10-19 00:00:00,40219,NO,BODY,2010-01-13 00:00:00,RELEASED,,,UNKNOWN
2010-01-12 00:00:00,CAT,,UNKNOWN,BLK-WHT,,,40208,NO,BODY,2010-01-12 00:00:00,UNKNOWN,,,UNKNOWN
2010-01-14 00:00:00,DOG,,UNKNOWN,TAN,,,40206,YES,BODY,2010-01-15 00:00:00,UNKNOWN,,,UNKNOWN
2010-01-14 00:00:00,DOG,,MALE,YELLOW,1,2010-01-01 00:00:00,40299,NO,BODY,2010-01-20 00:00:00,RELEASED,,,UNKNOWN
2010-01-15 00:00:00,DOG,,MALE,BLACK/BROW,1,2010-02-02 00:00:00,40272,NO,HEAD,2010-01-19 00:00:00,RELEASED,,,UNKNOWN
2010-01-16 00:00:00,CAT,,FEMALE,BLK-WHT,1,2010-02-02 00:00:00,40222,NO,BODY,2010-01-19 00:00:00,RELEASED,,,UNKNOWN
2010-01-16 00:00:00,DOG,,MALE,TRI,3,2009-05-02 00:00:00,40219,NO,BODY,2010-01-21 00:00:00,UNKNOWN,,,UNKNOWN
2010-01-16 00:00:00,DOG,,MALE,BLUE,1,2010-01-29 00:00:00,40205,NO,BODY,2010-01-20 00:00:00,RELEASED,,,UNKNOWN
2010-01-17 00:00:00,CAT,,MALE,BROWN,1,2009-12-22 00:00:00,40206,NO,BODY,2010-01-19 00:00:00,RELEASED,,,UNKNOWN
2010-01-19 00:00:00,DOG,,MALE,BLK,3,2009-05-01 00:00:00,40207,NO,BODY,2010-01-20 00:00:00,RELEASED,,,UNKNOWN
2010-01-20 00:00:00,DOG,,MALE,BLK,1,2009-12-11 00:00:00,40223,NO,BODY,2010-01-28 00:00:00,RELEASED,,,UNKNOWN
2010-01-21 00:00:00,DOG,,FEMALE,BRN,1,2009-07-13 00:00:00,40223,NO,HEAD,2010-01-25 00:00:00,RELEASED,,,UNKNOWN
2010-01-22 00:00:00,CAT,,MALE,BLK-WHT,,,40258,YES,BODY,2010-01-25 00:00:00,UNKNOWN,,,UNKNOWN
2010-01-23 00:00:00,DOG,,UNKNOWN,YELLOW,,,40208,YES,BODY,2010-01-25 00:00:00,UNKNOWN,,,UNKNOWN
2010-01-24 00:00:00,DOG,,MALE,RED,3,2008-02-11 00:00:00,40245,NO,HEAD,2010-01-26 00:00:00,RELEASED,,,UNKNOWN
2010-01-25 00:00:00,CAT,,FEMALE,GRAY-TORTI,,,40208,NO,HEAD,2010-01-28 00:00:00,UNKNOWN,,,UNKNOWN
2010-01-25 00:00:00,DOG,,FEMALE,FAWN-WHT,1,2010-02-08 00:00:00,42784,NO,BODY,2010-01-25 00:00:00,RELEASED,,,UNKNOWN
2010-01-25 00:00:00,DOG,,FEMALE,BRN-WHT,,,40165,NO,BODY,2010-01-28 00:00:00,RELEASED,,,UNKNOWN
2010-01-26 00:00:00,DOG,,MALE,BROWN-BLK,,,40206,NO,BODY,2010-01-27 00:00:00,RELEASED,,,UNKNOWN
2010-01-27 00:00:00,DOG,,MALE,BLACK,1,2010-03-01 00:00:00,40299,NO,BODY,2010-01-28 00:00:00,RELEASED,,,UNKNOWN
2010-01-27 00:00:00,CAT,,UNKNOWN,,,,40220,YES,BODY,2010-01-28 00:00:00,UNKNOWN,,,UNKNOWN
2010-01-27 00:00:00,DOG,,UNKNOWN,,,,40291,YES,BODY,2010-01-28 00:00:00,UNKNOWN,,,UNKNOWN
2010-01-27 00:00:00,DOG,,UNKNOWN,YELLOW,1,2009-09-18 00:00:00,40272,NO,BODY,2010-02-01 00:00:00,RELEASED,,,UNKNOWN
2010-01-27 00:00:00,DOG,,FEMALE,BRN-BLACK,1,2010-07-30 00:00:00,40229,NO,BODY,2011-01-28 00:00:00,UNKNOWN,,,UNKNOWN
2010-01-28 00:00:00,DOG,,FEMALE,TAN,1,2009-10-05 00:00:00,40218,NO,HEAD,2010-02-01 00:00:00,RELEASED,,,UNKNOWN
2010-01-28 00:00:00,DOG,,FEMALE,BLK-TAN,1,2009-07-16 00:00:00,40204,NO,BODY,2010-02-01 00:00:00,RELEASED,,,UNKNOWN
2010-01-29 00:00:00,DOG,,MALE,BLK-WHT,,,40210,NO,HEAD,2010-02-02 00:00:00,RELEASED,,,UNKNOWN
2010-01-29 00:00:00,DOG,,FEMALE,TAN,1,2009-03-17 00:00:00,40291,NO,BODY,2010-02-01 00:00:00,RELEASED,,,UNKNOWN
2010-01-30 00:00:00,DOG,,UNKNOWN,,,,40118,NO,HEAD,2010-02-01 00:00:00,UNKNOWN,,,UNKNOWN
2010-01-30 00:00:00,CAT,,FEMALE,BLK,1,2010-02-19 00:00:00,46011,NO,BODY,2010-02-01 00:00:00,RELEASED,,,UNKNOWN
2010-01-30 00:00:00,DOG,,MALE,RED-WHT,1,2009-03-18 00:00:00,40218,NO,BODY,2010-02-01 00:00:00,RELEASED,,,UNKNOWN
2010-01-30 00:00:00,DOG,,MALE,BLK-TAN,,,40229,NO,BODY,2010-01-30 00:00:00,UNKNOWN,,,UNKNOWN
2010-01-31 00:00:00,CAT,,MALE,TAN-BRN,1,2010-02-19 00:00:00,40299,NO,HEAD,2010-02-01 00:00:00,RELEASED,,,UNKNOWN
2010-01-31 00:00:00,DOG,,MALE,B.MERLE-GR,,,40212,YES,HEAD,2010-02-01 00:00:00,UNKNOWN,,,UNKNOWN
2010-01-31 00:00:00,DOG,,MALE,BLK-WHT,1,2009-02-14 00:00:00,40220,NO,BODY,2010-02-01 00:00:00,RELEASED,,,UNKNOWN
2010-02-01 00:00:00,DOG,,MALE,BROWN,1,2009-08-12 00:00:00,40215,NO,BODY,2010-02-01 00:00:00,RELEASED,,,UNKNOWN
2010-02-01 00:00:00,CAT,,MALE,GRAY-WHT,,,40291,NO,BODY,2010-02-01 00:00:00,UNKNOWN,,,UNKNOWN
2010-02-01 00:00:00,DOG,,MALE,TAN-WHT,,,40211,NO,BODY,2010-02-01 00:00:00,UNKNOWN,,,UNKNOWN
2010-02-02 00:00:00,DOG,,MALE,BLONDE,1,2010-01-23 00:00:00,40059,NO,HEAD,2010-02-04 00:00:00,RELEASED,,,UNKNOWN
2010-02-02 00:00:00,CAT,,UNKNOWN,GRAY-WHITE,,,40203,NO,BODY,2010-02-02 00:00:00,UNKNOWN,,,UNKNOWN
2010-02-03 00:00:00,DOG,,MALE,BROWN-BLK,1,2009-05-12 00:00:00,40205,NO,BODY,2010-02-03 00:00:00,RELEASED,,,UNKNOWN
2010-02-04 00:00:00,DOG,,UNKNOWN,,,,40229,NO,BODY,,UNKNOWN,2010-02-05 00:00:00,,UNKNOWN
2010-02-04 00:00:00,DOG,,UNKNOWN,BRN-WHT,,2007-06-01 00:00:00,40228,NO,BODY,2010-02-04 00:00:00,UNKNOWN,,,UNKNOWN
2010-02-05 00:00:00,DOG,,MALE,WHT,,,40217,NO,BODY,2010-02-05 00:00:00,RELEASED,,,UNKNOWN
2010-02-05 00:00:00,DOG,,MALE,BROWN,,,40229,NO,HEAD,2010-02-08 00:00:00,UNKNOWN,,,UNKNOWN
2010-02-05 00:00:00,DOG,,UNKNOWN,,,,40220,YES,BODY,2010-02-08 00:00:00,UNKNOWN,,,UNKNOWN
2010-02-06 00:00:00,DOG,,MALE,BLK-BRN,,,40272,NO,BODY,2010-02-06 00:00:00,UNKNOWN,,,UNKNOWN
2010-02-07 00:00:00,DOG,,FEMALE,WHT-BRN,3,2009-08-15 00:00:00,40215,NO,HEAD,2010-02-10 00:00:00,RELEASED,,,UNKNOWN
2010-02-07 00:00:00,DOG,,MALE,TRI,3,2009-02-16 00:00:00,40228,NO,BODY,2010-02-08 00:00:00,RELEASED,,,UNKNOWN
2010-02-09 00:00:00,CAT,,UNKNOWN,BLK-WHT,,,40203,NO,BODY,2010-02-09 00:00:00,UNKNOWN,,,UNKNOWN
2010-02-09 00:00:00,CAT,,UNKNOWN,GREY,1,2009-08-20 00:00:00,40218,NO,BODY,2010-02-16 00:00:00,RELEASED,,,UNKNOWN
2010-02-10 00:00:00,DOG,,UNKNOWN,,,,40218,YES,BODY,2010-02-10 00:00:00,UNKNOWN,,,UNKNOWN
2010-02-10 00:00:00,DOG,,MALE,GRAY,1,2010-01-26 00:00:00,40214,NO,BODY,2010-02-11 00:00:00,RELEASED,,,UNKNOWN
2010-02-10 00:00:00,DOG,,FEMALE,BLK,1,2010-01-18 00:00:00,40204,NO,BODY,2010-02-11 00:00:00,RELEASED,,,UNKNOWN
2010-02-10 00:00:00,DOG,,MALE,BLK-WHT,1,2009-08-22 00:00:00,40014,NO,BODY,2010-02-19 00:00:00,RELEASED,,,UNKNOWN
2010-02-10 00:00:00,CAT,,FEMALE,BLK-WHT,1,2009-06-09 00:00:00,40207,NO,BODY,2010-02-22 00:00:00,RELEASED,,,UNKNOWN
2010-02-11 00:00:00,DOG,,FEMALE,SILVER,1,2010-03-03 00:00:00,40217,NO,BODY,2010-02-11 00:00:00,RELEASED,,,UNKNOWN
2010-02-11 00:00:00,DOG,,UNKNOWN,,,,40229,YES,HEAD,2010-02-12 00:00:00,UNKNOWN,,,UNKNOWN
2010-02-11 00:00:00,DOG,,UNKNOWN,,,,40206,YES,BODY,2010-02-12 00:00:00,UNKNOWN,,,UNKNOWN
2010-02-12 00:00:00,DOG,,MALE,BRN-WHT,1,2010-03-02 00:00:00,40218,NO,BODY,2010-02-16 00:00:00,RELEASED,,,UNKNOWN
2010-02-12 00:00:00,CAT,,UNKNOWN,GREY,,,40208,NO,BODY,2010-02-12 00:00:00,UNKNOWN,,,UNKNOWN
2010-02-12 00:00:00,DOG,,MALE,BLK,1,2010-02-22 00:00:00,40229,NO,BODY,2010-02-17 00:00:00,RELEASED,,,UNKNOWN
2010-02-13 00:00:00,CAT,,UNKNOWN,GREY,1,2010-02-11 00:00:00,40242,NO,BODY,2010-02-16 00:00:00,RELEASED,,,UNKNOWN
2010-02-14 00:00:00,DOG,,UNKNOWN,BRN,1,2009-10-07 00:00:00,40207,NO,BODY,2010-02-22 00:00:00,RELEASED,,,UNKNOWN
2010-02-15 00:00:00,DOG,,UNKNOWN,BLK,,,40216,NO,HEAD,2010-02-18 00:00:00,RELEASED,,,UNKNOWN
2010-02-16 00:00:00,DOG,,UNKNOWN,BRN,,,40272,NO,BODY,,UNKNOWN,2010-02-18 00:00:00,,UNKNOWN
2010-02-16 00:00:00,CAT,,FEMALE,BLK,,,40217,NO,BODY,2010-02-16 00:00:00,UNKNOWN,,,UNKNOWN
2010-02-16 00:00:00,DOG,,FEMALE,GRAY,1,2009-05-31 00:00:00,40245,NO,BODY,2010-02-24 00:00:00,RELEASED,,,UNKNOWN
2010-02-18 00:00:00,DOG,,UNKNOWN,,,,40217,YES,BODY,2010-02-18 00:00:00,UNKNOWN,,,UNKNOWN
2010-02-18 00:00:00,CAT,,MALE,ORANGE,1,2010-03-01 00:00:00,40229,NO,BODY,2010-02-19 00:00:00,RELEASED,,,UNKNOWN
2010-02-18 00:00:00,DOG,,MALE,TRI,1,2009-09-26 00:00:00,40299,NO,BODY,2010-02-19 00:00:00,RELEASED,,,UNKNOWN
2010-02-18 00:00:00,DOG,,MALE,BLACK-TAN,1,2009-07-02 00:00:00,40241,NO,BODY,2010-02-19 00:00:00,RELEASED,,,UNKNOWN
2010-02-19 00:00:00,DOG,,MALE,WHT,1,2009-11-13 00:00:00,40291,NO,BODY,2010-02-19 00:00:00,RELEASED,,,UNKNOWN
2010-02-20 00:00:00,CAT,,FEMALE,WHT-BLK,1,2009-08-06 00:00:00,40241,NO,BODY,2010-02-22 00:00:00,RELEASED,,,UNKNOWN
2010-02-20 00:00:00,DOG,,UNKNOWN,BRINDLE-WH,,2010-01-02 00:00:00,40210,NO,BODY,2010-02-20 00:00:00,UNKNOWN,,,UNKNOWN
2010-02-20 00:00:00,DOG,,UNKNOWN,RED-WHT,1,2009-07-29 00:00:00,40206,NO,BODY,2010-02-22 00:00:00,RELEASED,,,UNKNOWN
2010-02-21 00:00:00,CAT,,FEMALE,WHT-BLK,,,40219,NO,HEAD,2010-02-21 00:00:00,UNKNOWN,,,UNKNOWN
2010-02-21 00:00:00,DOG,,FEMALE,WHT-TAN,3,2009-12-04 00:00:00,,NO,BODY,2010-02-22 00:00:00,RELEASED,,,UNKNOWN
2010-02-21 00:00:00,DOG,,FEMALE,BLK-TAN,3,2008-12-15 00:00:00,47150,NO,BODY,2010-02-22 00:00:00,RELEASED,,,UNKNOWN
2010-02-21 00:00:00,CAT,,UNKNOWN,BRN-WHT,,,40299,NO,BODY,2010-02-21 00:00:00,UNKNOWN,,,UNKNOWN
2010-02-22 00:00:00,DOG,,UNKNOWN,,,,40272,YES,BODY,2010-02-23 00:00:00,UNKNOWN,,,UNKNOWN
2010-02-22 00:00:00,DOG,,FEMALE,BRN-WHT,3,2009-08-05 00:00:00,40214,NO,BODY,2010-02-24 00:00:00,RELEASED,,,UNKNOWN
2010-02-22 00:00:00,DOG,,UNKNOWN,TAN-WHT,,2009-10-26 00:00:00,40216,NO,HEAD,2010-02-22 00:00:00,UNKNOWN,,,UNKNOWN
2010-02-23 00:00:00,DOG,,UNKNOWN,,,,40216,NO,HEAD,2010-02-24 00:00:00,RELEASED,,,UNKNOWN
2010-02-23 00:00:00,DOG,,UNKNOWN,,,,40220,YES,HEAD,2010-02-24 00:00:00,UNKNOWN,,,UNKNOWN
2010-02-23 00:00:00,CAT,,MALE,LT. BR,1,2009-05-05 00:00:00,40047,NO,BODY,2010-02-26 00:00:00,RELEASED,,,UNKNOWN
2010-02-25 00:00:00,DOG,,FEMALE,BLK,1,2010-02-24 00:00:00,40241,NO,BODY,2010-03-01 00:00:00,RELEASED,,,UNKNOWN
2010-02-25 00:00:00,DOG,,FEMALE,TRI,1,2010-03-24 00:00:00,40258,NO,BODY,2010-03-01 00:00:00,RELEASED,,,UNKNOWN
2010-02-25 00:00:00,DOG,,MALE,BRN,,,40216,NO,HEAD,2010-02-25 00:00:00,UNKNOWN,,,UNKNOWN
2010-02-26 00:00:00,DOG,,MALE,WHT-BLK,,,40059,NO,HEAD,,UNKNOWN,2010-02-27 00:00:00,,UNKNOWN
2010-02-26 00:00:00,DOG,,UNKNOWN,,,,40059,NO,HEAD,,UNKNOWN,2010-02-27 00:00:00,,UNKNOWN
2010-02-26 00:00:00,DOG,,FEMALE,BLACK,1,2010-03-09 00:00:00,40059,NO,BODY,2010-02-26 00:00:00,RELEASED,,,UNKNOWN
2010-02-26 00:00:00,DOG,,MALE,RED,1,2010-03-12 00:00:00,40206,NO,BODY,2010-03-01 00:00:00,RELEASED,,,UNKNOWN
2010-02-26 00:00:00,DOG,,MALE,BLK-BRN,,,40118,NO,BODY,2010-03-01 00:00:00,RELEASED,,,UNKNOWN
2010-02-27 00:00:00,DOG,,MALE,BLK-WHT,1,2009-06-08 00:00:00,40222,NO,BODY,2010-03-01 00:00:00,RELEASED,,,UNKNOWN
2010-02-27 00:00:00,CAT,,UNKNOWN,GRAY,,,40215,NO,BODY,2010-02-27 00:00:00,UNKNOWN,,,UNKNOWN
2010-02-27 00:00:00,DOG,,UNKNOWN,BLONDE,,,40210,YES,BODY,2010-03-04 00:00:00,UNKNOWN,,,UNKNOWN
2010-02-28 00:00:00,CAT,,FEMALE,GRAY,1,2009-03-21 00:00:00,40222,NO,BODY,2010-03-01 00:00:00,RELEASED,,,UNKNOWN
2010-02-28 00:00:00,DOG,,UNKNOWN,,,,40272,NO,HEAD,2010-03-01 00:00:00,UNKNOWN,,,UNKNOWN
2010-02-28 00:00:00,CAT,,UNKNOWN,,,,40211,YES,BODY,2010-03-01 00:00:00,UNKNOWN,,,UNKNOWN
2010-03-01 00:00:00,BAT,,UNKNOWN,,,,40219,NO,BODY,,UNKNOWN,2010-03-02 00:00:00,,UNKNOWN
2010-03-01 00:00:00,DOG,,UNKNOWN,,,,,NO,BODY,,UNKNOWN,,,UNKNOWN
2010-03-01 00:00:00,DOG,,FEMALE,BLK-WHT,3,2008-12-31 00:00:00,40241,NO,BODY,2010-03-05 00:00:00,RELEASED,,,UNKNOWN
2010-03-02 00:00:00,CAT,,UNKNOWN,,,,40203,NO,BODY,2010-03-02 00:00:00,UNKNOWN,,,UNKNOWN
2010-03-03 00:00:00,CAT,,MALE,GRAY-WHT,,,40118,NO,HEAD,2010-03-08 00:00:00,UNKNOWN,,,UNKNOWN
2010-03-05 00:00:00,CAT,,UNKNOWN,ORANGE,,2009-07-25 00:00:00,40223,NO,BODY,2010-03-05 00:00:00,UNKNOWN,2010-03-06 00:00:00,,UNKNOWN
2010-03-05 00:00:00,DOG,,FEMALE,BR. BRINDL,,,40215,NO,BODY,2010-03-05 00:00:00,UNKNOWN,,,UNKNOWN
2010-03-05 00:00:00,DOG,,MALE,WHT,1,,40204,NO,BODY,2010-03-15 00:00:00,RELEASED,,,UNKNOWN
2010-03-06 00:00:00,DOG,,MALE,TAN,,,40272,NO,HEAD,2010-03-09 00:00:00,RELEASED,,,UNKNOWN
2010-03-06 00:00:00,DOG,,MALE,BRN,1,2010-03-25 00:00:00,40220,NO,HEAD,2010-03-09 00:00:00,RELEASED,,,UNKNOWN
2010-03-06 00:00:00,DOG,,UNKNOWN,BRN-WHT,,,40203,NO,BODY,2010-03-06 00:00:00,UNKNOWN,,,UNKNOWN
2010-03-06 00:00:00,DOG,,UNKNOWN,BRN,,2010-03-05 00:00:00,40210,NO,BODY,2010-03-06 00:00:00,UNKNOWN,,,UNKNOWN
2010-03-06 00:00:00,DOG,,UNKNOWN,BLK-TAN,1,2010-01-11 00:00:00,40299,YES,BODY,2010-03-08 00:00:00,RELEASED,,,UNKNOWN
2010-03-07 00:00:00,DOG,,FEMALE,YELLOW,,,40118,NO,HEAD,2010-03-08 00:00:00,UNKNOWN,,,UNKNOWN
2010-03-07 00:00:00,DOG,,UNKNOWN,,,,,NO,BODY,2010-03-08 00:00:00,UNKNOWN,,,UNKNOWN
2010-03-07 00:00:00,DOG,,FEMALE,BLK,,,40216,NO,BODY,2010-03-08 00:00:00,RELEASED,,,UNKNOWN
2010-03-07 00:00:00,DOG,,MALE,BLK-BRN,1,2009-08-26 00:00:00,40243,NO,BODY,2010-03-11 00:00:00,RELEASED,,,UNKNOWN
2010-03-07 00:00:00,DOG,,UNKNOWN,BLK-WHT,,,40206,NO,BODY,2010-03-15 00:00:00,RELEASED,,,UNKNOWN
2010-03-08 00:00:00,DOG,,MALE,BRN-WHT,,,40216,NO,BODY,2010-03-08 00:00:00,UNKNOWN,2010-03-09 00:00:00,,UNKNOWN
2010-03-08 00:00:00,DOG,,MALE,CREAM,1,2010-03-08 00:00:00,40241,NO,HEAD,2010-03-09 00:00:00,RELEASED,,,UNKNOWN
2010-03-08 00:00:00,DOG,,MALE,BLK-WHT,1,2009-08-03 00:00:00,40208,NO,BODY,2010-03-10 00:00:00,RELEASED,,,UNKNOWN
2010-03-08 00:00:00,DOG,,UNKNOWN,WHT,,,40258,YES,BODY,2010-03-10 00:00:00,UNKNOWN,,,UNKNOWN
2010-03-08 00:00:00,DOG,,MALE,BLK,,,40222,NO,BODY,2010-03-15 00:00:00,UNKNOWN,,,UNKNOWN
2010-03-08 00:00:00,DOG,,FEMALE,TAN,,,40211,NO,BODY,2010-03-08 00:00:00,UNKNOWN,,,UNKNOWN
2010-03-09 00:00:00,DOG,,UNKNOWN,,,,40203,YES,BODY,2010-03-10 00:00:00,UNKNOWN,,,UNKNOWN
2010-03-09 00:00:00,DOG,,UNKNOWN,BLACK,3,2009-05-08 00:00:00,40291,NO,BODY,2010-03-15 00:00:00,RELEASED,,,UNKNOWN
2010-03-10 00:00:00,DOG,,UNKNOWN,,,,40216,NO,HEAD,2010-03-10 00:00:00,UNKNOWN,,,UNKNOWN
2010-03-10 00:00:00,DOG,,MALE,TRI,1,2009-11-07 00:00:00,40006,NO,BODY,2010-03-11 00:00:00,RELEASED,,,UNKNOWN
2010-03-10 00:00:00,DOG,,FEMALE,BLACK,1,2010-03-25 00:00:00,40223,NO,BODY,2010-03-15 00:00:00,RELEASED,,,UNKNOWN
2010-03-10 00:00:00,DOG,,MALE,TAN-WHT,,,40211,NO,BODY,2010-03-19 00:00:00,UNKNOWN,,,UNKNOWN
2010-03-11 00:00:00,DOG,,FEMALE,TAN,,,40272,NO,BODY,,UNKNOWN,2010-03-12 00:00:00,,UNKNOWN
2010-03-11 00:00:00,DOG,,UNKNOWN,,,,40212,NO,BODY,2010-03-11 00:00:00,UNKNOWN,,,UNKNOWN
2010-03-11 00:00:00,CAT,,FEMALE,TRI,1,2010-03-25 00:00:00,40219,NO,BODY,2010-03-11 00:00:00,RELEASED,,,UNKNOWN
2010-03-11 00:00:00,CAT,,FEMALE,BLK-WHT,1,2010-03-23 00:00:00,40245,NO,BODY,2010-03-11 00:00:00,RELEASED,,,UNKNOWN
2010-03-11 00:00:00,DOG,,FEMALE,CREAM-WHT,1,2010-03-15 00:00:00,40222,NO,HEAD,2010-03-15 00:00:00,RELEASED,,,UNKNOWN
2010-03-11 00:00:00,DOG,,FEMALE,WHITE,1,2010-03-18 00:00:00,40216,NO,BODY,2010-03-15 00:00:00,RELEASED,,,UNKNOWN
2010-03-12 00:00:00,DOG,,UNKNOWN,,,,40242,NO,HEAD,2010-03-17 00:00:00,RELEASED,,,UNKNOWN
2010-03-12 00:00:00,DOG,,MALE,TRI,1,2009-07-06 00:00:00,40219,NO,BODY,2010-03-15 00:00:00,RELEASED,,,UNKNOWN
2010-03-12 00:00:00,CAT,,UNKNOWN,,,,40299,YES,BODY,2010-03-15 00:00:00,UNKNOWN,,,UNKNOWN
2010-03-13 00:00:00,DOG,,FEMALE,TRI,1,2009-06-18 00:00:00,40291,NO,BODY,2010-03-15 00:00:00,RELEASED,,,UNKNOWN
2010-03-13 00:00:00,DOG,,MALE,WHT,1,2009-04-18 00:00:00,40216,NO,BODY,2010-03-15 00:00:00,RELEASED,,,UNKNOWN
2010-03-13 00:00:00,DOG,,MALE,BRN-WHT,1,2009-09-16 00:00:00,40241,NO,HEAD,2010-03-17 00:00:00,RELEASED,,,UNKNOWN
2010-03-13 00:00:00,DOG,,FEMALE,BRINDLE,1,2009-11-30 00:00:00,40214,NO,BODY,2010-03-16 00:00:00,RELEASED,,,UNKNOWN
2010-03-14 00:00:00,DOG,,MALE,BLACK,1,2010-04-10 00:00:00,40299,NO,BODY,2010-03-16 00:00:00,RELEASED,,,UNKNOWN
2010-03-16 00:00:00,DOG,,UNKNOWN,,,,40211,YES,BODY,2010-03-16 00:00:00,UNKNOWN,,,UNKNOWN
2010-03-16 00:00:00,DOG,,MALE,WHITE,1,2009-09-28 00:00:00,40272,NO,BODY,2010-03-17 00:00:00,RELEASED,,,UNKNOWN
2010-03-16 00:00:00,DOG,,UNKNOWN,GOLDEN,1,2009-12-23 00:00:00,40272,NO,BODY,2010-03-26 00:00:00,RELEASED,,,UNKNOWN
2010-03-17 00:00:00,DOG,,UNKNOWN,BLK-WHT,,2009-11-03 00:00:00,40272,NO,HEAD,,UNKNOWN,2010-03-18 00:00:00,,UNKNOWN
2010-03-17 00:00:00,DOG,,MALE,BLACK,1,2010-02-25 00:00:00,40258,NO,BODY,2010-03-23 00:00:00,RELEASED,,,UNKNOWN
2010-03-18 00:00:00,DOG,,UNKNOWN,TAN-WHT,1,2009-08-17 00:00:00,40203,NO,BODY,2010-03-19 00:00:00,RELEASED,,,UNKNOWN
2010-03-18 00:00:00,DOG,,UNKNOWN,BLACK-WHT,,,40219,NO,BODY,2010-03-18 00:00:00,UNKNOWN,,,UNKNOWN
2010-03-19 00:00:00,CAT,,FEMALE,GRAY,1,2009-07-03 00:00:00,40213,NO,BODY,2010-03-22 00:00:00,RELEASED,,,UNKNOWN
2010-03-19 00:00:00,CAT,,UNKNOWN,BUFF,,,40213,NO,HEAD,2010-03-19 00:00:00,UNKNOWN,,,UNKNOWN
2010-03-19 00:00:00,DOG,,FEMALE,BROWN-TAN,1,2009-04-10 00:00:00,40218,NO,BODY,2010-03-23 00:00:00,RELEASED,,,UNKNOWN
2010-03-19 00:00:00,DOG,,MALE,BLK-TAN,,2009-03-18 00:00:00,40203,NO,BODY,2010-03-19 00:00:00,UNKNOWN,,,UNKNOWN
2010-03-20 00:00:00,CAT,,UNKNOWN,,,,40207,NO,BODY,2010-03-22 00:00:00,UNKNOWN,,,UNKNOWN
2010-03-20 00:00:00,DOG,,FEMALE,TRI,,,40291,NO,BODY,2010-03-22 00:00:00,UNKNOWN,,,UNKNOWN